Znam da mi pocetnici ubismo sa problemima ali ja ne mogu nista da uradim dok ne instaliram modem. Pokusavam vec 5 dana sve moduce drivere i savete ali u principu uvek isto.
modem intel ambient 536ep
Suse 9.3
linux:~/1/intel-536EP-2.56.76.0-suse91-UP # make 536
Module precompile check
Current running kernel is: 2.6.11.4-20a-default
/lib/modules... autoconf.h exists
diff: /boot/vmlinuz.autoconf.h: No such file or directory
autoconf.h matches running kernel
diff: /boot/vmlinuz.version.h: No such file or directory
version.h matches running kernel
uname -r|grep "2.6" && \
cd coredrv && make 536core_26 && \
cp Intel536.ko .. && cd .. && \
strip --strip-debug Intel536.ko && \
exit; \
ls Intel536.ko >/dev/null 2>&1 || uname -r | grep "2.6" && echo "Failed to buil
d driver" && exit; \
if [ ]; then \
cd coredrv; make TARGET=TARGET_SELAH KERNEL_SOURCE_PATH= "PSTN_DEF=-DTARGET_SELA
H -DTARGET_LINUX -DLINUX" 536core; \
else \
cd coredrv; make TARGET=TARGET_SELAH KERNEL_INCLUDES=/lib/modules/`uname -r`/bui
ld/include \
"PSTN_DEF=-DTARGET_SELAH -DTARGET_LINUX -DLINUX" 536core; \
fi ; \
cp Intel536.o .. ; \
if [ -a /boot/vmlinuz.version.h ]; then \
cp /boot/vmlinuz.version.h /lib/modules/`uname -r`/build/include/linux/v
ersion.h;\
fi
2.6.11.4-20a-default
make[1]: Entering directory `/root/1/intel-536EP-2.56.76.0-suse91-UP/coredrv'
make -C /lib/modules/2.6.11.4-20a-default/build SUBDIRS=/root/1/intel-536EP-2.56
.76.0-suse91-UP/coredrv modules
make[2]: Entering directory `/usr/src/linux-2.6.11.4-20a-obj/i386/default'
make -C ../../../linux-2.6.11.4-20a O=../linux-2.6.11.4-20a-obj/i386/default mod
ules
CC [M] /root/1/intel-536EP-2.56.76.0-suse91-UP/coredrv/coredrv.o
/root/1/intel-536EP-2.56.76.0-suse91-UP/coredrv/coredrv.c:70: warning: type defa
ults to `int' in declaration of `EXPORT_SYMBOL_NOVERS'
/root/1/intel-536EP-2.56.76.0-suse91-UP/coredrv/coredrv.c:70: warning: parameter
names (without types) in function declaration
/root/1/intel-536EP-2.56.76.0-suse91-UP/coredrv/coredrv.c:70: warning: data defi
nition has no type or storage class
/root/1/intel-536EP-2.56.76.0-suse91-UP/coredrv/coredrv.c: In function `power_ca
llback':
/root/1/intel-536EP-2.56.76.0-suse91-UP/coredrv/coredrv.c:295: error: `PM_SAVE_S
TATE' undeclared (first use in this function)
/root/1/intel-536EP-2.56.76.0-suse91-UP/coredrv/coredrv.c:295: error: (Each unde
clared identifier is reported only once
/root/1/intel-536EP-2.56.76.0-suse91-UP/coredrv/coredrv.c:295: error: for each f
unction it appears in.)
/root/1/intel-536EP-2.56.76.0-suse91-UP/coredrv/coredrv.c: In function `softcore
_init_struct':
/root/1/intel-536EP-2.56.76.0-suse91-UP/coredrv/coredrv.c:337: warning: assignme
nt from incompatible pointer type
/root/1/intel-536EP-2.56.76.0-suse91-UP/coredrv/coredrv.c: In function `close':
/root/1/intel-536EP-2.56.76.0-suse91-UP/coredrv/coredrv.c:418: warning: `pm_unre
gister' is deprecated (declared at /usr/src/linux-2.6.11.4-20a/include/linux/pm.
h:111)
/root/1/intel-536EP-2.56.76.0-suse91-UP/coredrv/coredrv.c: At top level:
/root/1/intel-536EP-2.56.76.0-suse91-UP/coredrv/coredrv.c:756: warning: initiali
zation from incompatible pointer type
/root/1/intel-536EP-2.56.76.0-suse91-UP/coredrv/coredrv.c:757: warning: initiali zation from incompatible pointer type
/root/1/intel-536EP-2.56.76.0-suse91-UP/coredrv/coredrv.c: In function `kSchedul eDPC':
/root/1/intel-536EP-2.56.76.0-suse91-UP/coredrv/coredrv.c:863: warning: implicit declaration of function `pm_access'
/root/1/intel-536EP-2.56.76.0-suse91-UP/coredrv/coredrv.c: In function `dspdrv_C ommRamISR':
/root/1/intel-536EP-2.56.76.0-suse91-UP/coredrv/coredrv.c:879: warning: function declaration isn't a prototype
/usr/src/linux-2.6.11.4-20a/include/linux/module.h: At top level:
/root/1/intel-536EP-2.56.76.0-suse91-UP/coredrv/coredrv.c:286: warning: `power_c allback' defined but not used
make[5]: *** [/root/1/intel-536EP-2.56.76.0-suse91-UP/coredrv/coredrv.o] Error 1
make[4]: *** [_module_/root/1/intel-536EP-2.56.76.0-suse91-UP/coredrv] Error 2
make[3]: *** [modules] Error 2
make[2]: *** [modules] Error 2
make[2]: Leaving directory `/usr/src/linux-2.6.11.4-20a-obj/i386/default'
make[1]: *** [536core_26] Error 2
make[1]: Leaving directory `/root/1/intel-536EP-2.56.76.0-suse91-UP/coredrv'
2.6.11.4-20a-default
Failed to build driver
Ako moze neko da pomogne hvala unapred
modem intel ambient 536ep
Suse 9.3
linux:~/1/intel-536EP-2.56.76.0-suse91-UP # make 536
Module precompile check
Current running kernel is: 2.6.11.4-20a-default
/lib/modules... autoconf.h exists
diff: /boot/vmlinuz.autoconf.h: No such file or directory
autoconf.h matches running kernel
diff: /boot/vmlinuz.version.h: No such file or directory
version.h matches running kernel
uname -r|grep "2.6" && \
cd coredrv && make 536core_26 && \
cp Intel536.ko .. && cd .. && \
strip --strip-debug Intel536.ko && \
exit; \
ls Intel536.ko >/dev/null 2>&1 || uname -r | grep "2.6" && echo "Failed to buil
d driver" && exit; \
if [ ]; then \
cd coredrv; make TARGET=TARGET_SELAH KERNEL_SOURCE_PATH= "PSTN_DEF=-DTARGET_SELA
H -DTARGET_LINUX -DLINUX" 536core; \
else \
cd coredrv; make TARGET=TARGET_SELAH KERNEL_INCLUDES=/lib/modules/`uname -r`/bui
ld/include \
"PSTN_DEF=-DTARGET_SELAH -DTARGET_LINUX -DLINUX" 536core; \
fi ; \
cp Intel536.o .. ; \
if [ -a /boot/vmlinuz.version.h ]; then \
cp /boot/vmlinuz.version.h /lib/modules/`uname -r`/build/include/linux/v
ersion.h;\
fi
2.6.11.4-20a-default
make[1]: Entering directory `/root/1/intel-536EP-2.56.76.0-suse91-UP/coredrv'
make -C /lib/modules/2.6.11.4-20a-default/build SUBDIRS=/root/1/intel-536EP-2.56
.76.0-suse91-UP/coredrv modules
make[2]: Entering directory `/usr/src/linux-2.6.11.4-20a-obj/i386/default'
make -C ../../../linux-2.6.11.4-20a O=../linux-2.6.11.4-20a-obj/i386/default mod
ules
CC [M] /root/1/intel-536EP-2.56.76.0-suse91-UP/coredrv/coredrv.o
/root/1/intel-536EP-2.56.76.0-suse91-UP/coredrv/coredrv.c:70: warning: type defa
ults to `int' in declaration of `EXPORT_SYMBOL_NOVERS'
/root/1/intel-536EP-2.56.76.0-suse91-UP/coredrv/coredrv.c:70: warning: parameter
names (without types) in function declaration
/root/1/intel-536EP-2.56.76.0-suse91-UP/coredrv/coredrv.c:70: warning: data defi
nition has no type or storage class
/root/1/intel-536EP-2.56.76.0-suse91-UP/coredrv/coredrv.c: In function `power_ca
llback':
/root/1/intel-536EP-2.56.76.0-suse91-UP/coredrv/coredrv.c:295: error: `PM_SAVE_S
TATE' undeclared (first use in this function)
/root/1/intel-536EP-2.56.76.0-suse91-UP/coredrv/coredrv.c:295: error: (Each unde
clared identifier is reported only once
/root/1/intel-536EP-2.56.76.0-suse91-UP/coredrv/coredrv.c:295: error: for each f
unction it appears in.)
/root/1/intel-536EP-2.56.76.0-suse91-UP/coredrv/coredrv.c: In function `softcore
_init_struct':
/root/1/intel-536EP-2.56.76.0-suse91-UP/coredrv/coredrv.c:337: warning: assignme
nt from incompatible pointer type
/root/1/intel-536EP-2.56.76.0-suse91-UP/coredrv/coredrv.c: In function `close':
/root/1/intel-536EP-2.56.76.0-suse91-UP/coredrv/coredrv.c:418: warning: `pm_unre
gister' is deprecated (declared at /usr/src/linux-2.6.11.4-20a/include/linux/pm.
h:111)
/root/1/intel-536EP-2.56.76.0-suse91-UP/coredrv/coredrv.c: At top level:
/root/1/intel-536EP-2.56.76.0-suse91-UP/coredrv/coredrv.c:756: warning: initiali
zation from incompatible pointer type
/root/1/intel-536EP-2.56.76.0-suse91-UP/coredrv/coredrv.c:757: warning: initiali zation from incompatible pointer type
/root/1/intel-536EP-2.56.76.0-suse91-UP/coredrv/coredrv.c: In function `kSchedul eDPC':
/root/1/intel-536EP-2.56.76.0-suse91-UP/coredrv/coredrv.c:863: warning: implicit declaration of function `pm_access'
/root/1/intel-536EP-2.56.76.0-suse91-UP/coredrv/coredrv.c: In function `dspdrv_C ommRamISR':
/root/1/intel-536EP-2.56.76.0-suse91-UP/coredrv/coredrv.c:879: warning: function declaration isn't a prototype
/usr/src/linux-2.6.11.4-20a/include/linux/module.h: At top level:
/root/1/intel-536EP-2.56.76.0-suse91-UP/coredrv/coredrv.c:286: warning: `power_c allback' defined but not used
make[5]: *** [/root/1/intel-536EP-2.56.76.0-suse91-UP/coredrv/coredrv.o] Error 1
make[4]: *** [_module_/root/1/intel-536EP-2.56.76.0-suse91-UP/coredrv] Error 2
make[3]: *** [modules] Error 2
make[2]: *** [modules] Error 2
make[2]: Leaving directory `/usr/src/linux-2.6.11.4-20a-obj/i386/default'
make[1]: *** [536core_26] Error 2
make[1]: Leaving directory `/root/1/intel-536EP-2.56.76.0-suse91-UP/coredrv'
2.6.11.4-20a-default
Failed to build driver
Ako moze neko da pomogne hvala unapred